{"text_format":"1","workbook":"xlsx","n_sheets":6,"sheets":["MENU","Base_de_datos","Etiqueta_SGA","Matriz_incomp","Instructivo","Control de cambios del formato"],"not_rendered":{"charts":0,"images":45,"macros":1,"external_links":8,"defined_names":77,"comments":0,"pivot_tables":0},"unopened":[],"bounds":{"document_bytes":16777216,"sheet_cells":100000,"rows_first":2000,"rows_last":500,"rows_between":2000,"halvings":0,"cell_chars":16384,"cell_head_chars":4096},"cells_cut":0,"cells_raw":0,"read":"whole","date_system":"1900"}

{"sheet":"MENU","index":0,"n_rows":18,"n_cols":2,"rows_kept":18,"cut":false,"hidden":false,"merged":[[0,1,16,7],[17,1,17,7]]}
[]
[]
[]
[]
[]
[]
[]
[]
[]
[]
[]
[]
[]
[]
[]
[]
[]
[null,"Desarrollado por: Fundación para la Gestión del Riesgo - FGR. Versión 4. Marzo 2021"]

{"sheet":"Base_de_datos","index":1,"n_rows":34,"n_cols":39,"rows_kept":34,"cut":false,"hidden":false,"merged":[[1,33,2,33],[0,3,0,32],[1,16,1,24],[1,13,1,15],[1,25,1,26],[1,8,1,12],[1,27,1,32],[1,0,1,6]]}
[null,null,null,"BASE DE DATOS DE PRODUCTOS QUÍMICOS",null,null,null,null,null,null,null,null,null,null,null,null,null,null,null,null,null,null,null,null,null,null,null,null,null,null,null,null,null,null,"Versión 1"]
["INFORMACIÓN GENERAL",null,null,null,null,null,null,"CLIC AQUÍ","PROPIEDADES FISICO QUÍMICAS",null,null,null,null,"CLASIFICACIÓN PARA EL TRANSPORTE \nSEGÚN ONU",null,null,"SISTEMA GLOBALMENTE ARMONIZADO - SGA",null,null,null,null,null,null,null,null,"LIMITE DE EXPOSICIÓN",null,"FICHAS DE SEGURIDAD",null,null,null,null,null,"OBSERVACIONES","USO ACTUAL"]
["PROCESO OPERATIVO","ZONA DE ALMACENAMIENTO","NOMBRE COMERCIAL","COMPOSICIÓN","NÚMERO CAS","PRESENTACIÓN","PROVEEDOR/ FABRICANTE","CATEGORÍA IARC","Estado físico","pH","Temperatura de ebullición","Presión de vapor","Materiales incompatibles","NÚMERO UN","CLASE PRIMARIA DE PELIGRO","CLASE SECUNDARIA DE PELIGRO","CLASIFICACIÓN DE PELIGROS","NOMBRE DE LOS COMPONENTES QUE APORTAN LOS PELIGROS A LA SALUD","PICTOGRAMA 1","PICTOGRAMA 2","PICTOGRAMA 3","PICTOGRAMA 4","PALABRA DE ADVERTENCIA","FRASES H - INDICACIONES DE PELIGRO","FRASES P - CONSEJOS DE PRUDENCIA","LIMITE DE EXPOSICIÓN\n (TLV -TWA)","VALOR","CÓDIGO FDS","TIENE FDS","AÑO","IDIOMA","AUTOR","CUMPLE NORMATIVA VIGENTE",null," ACTIVA  - INACTIVA","Cantidad (al día)","Tiempo de exposición (al día)","Frecuencia (Frecuente, ocasional, intermitente,","No. De expuestos "]
["Utilizacion de limpieza o maquinas internas","INYECCION                               MANTENIMIENTO","DIESEL","COMBUSTIBLES, GASOLEO 95%","NP",null,"EXTERNO","2A","Líquido","NP",149,4.0000000000000001E-3,"NP",1202,"3. Líquido Inflamable","No aplica",null,"Combustibles gasoleo","GHS02_Llama","GHS07_Signo_de_exclamación","GHS08_Peligro_para_la_salud","GHS09_Medioambiente","PELIGRO","H226: Líquidos y vapores inflamables.\nH304: Puede ser mortal en caso de\ningestión y penetración en las vías\nrespiratorias.\nH315: Provoca irritación cutánea.\nH332: Nocivo en caso de inhalación.\nH351: Se sospecha que provoca\ncáncer.\nH373: Puede provocar daños en los\nórganos tras exposiciones prolongadas\no repetidas.\nH411: Tóxico para los organismos\nacuáticos, con efectos nocivos\nduraderos.","P210: Mantener alejado del calor, de\nsuperficies calientes, de chispas, de\nllamas abiertas y de cualquier otra\nfuente de ignición. No fumar.\nP261: Evitar respirar el polvo/el humo/el\ngas/la niebla/los vapores/el aerosol.\nP280: Llevar\nguantes/prendas/gafas/máscara de\nprotección.\nP301+P310: EN CASO DE\nINGESTIÓN: Llamar inmediatamente a\nun CENTRO DE TOXICOLOGÍA o a un\nmédico.\nP331: NO provocar el vómito.\nP501: Eliminar el contenido/recipiente\nen el contenedor habilitado para tal\nefecto conforme a la normativa vigente.","100 mg/m3",null,null,"SI",2016,"Español","PEPSOL","SI","Ninguna","Activa"]
["Utilizacion de limpieza o maquinas internas","MANTENIMIENTO","GASOLINA","NANFA (PETROLEO) , PRIMERA FRACCION DE LA DESTILACION DEL PETROLEO; NANFA DE BAJA TEMPERATURA DE INFLAMACION >99%","NP",null,"EXTERNO","2B","Líquido","NP",36,0.7,"NP",1203,"3. Líquido Inflamable","No aplica",null,"Nafta","GHS02_Llama","GHS07_Signo_de_exclamación","GHS08_Peligro_para_la_salud","GHS09_Medioambiente","PELIGRO","H224: Líquido y vapores\nextremadamente inflamables.\nH315: Provoca irritación cutánea.\nH304: Puede ser mortal en caso de\ningestión y penetración en las vías\nrespiratorias.\nH361: Se sospecha que perjudica la\nfertilidad o daña al feto.\nH340: Puede provocar defectos\ngenéticos.\nH350: Puede provocar cáncer.\nH336: Puede provocar somnolencia o\nvértigo.\nH411: Tóxico para los organismos\nacuáticos, con efectos nocivos\nduraderos.","P201: Pedir instrucciones especiales\nantes del uso.\nP210: Mantener alejado del calor, de\nsuperficies calientes, de chispas, de\nllamas abiertas y de cualquier otra\nfuente de ignición. No fumar.\nP280: Llevar\nguantes/prendas/gafas/máscara de\nprotección.\nP301+P310: EN CASO DE\nINGESTIÓN: Llamar inmediatamente a\nun CENTRO DE TOXICOLOGÍA o a un\nmédico.\nP403+P233: Almacenar en un lugar\nbien ventilado. Mantener el recipiente\ncerrado herméticamente.\nP501: Eliminar el contenido/recipiente\nen el contenedor habilitado para tal\nefecto conforme a la normativa vigente.","300 ppm",null,null,"SI",2016,"Español","PEPSOL","SI","Ninguna","Activa"]
["Lubricacion de maquinas","MANTENIMIENTO","ACEITE LUBRICANTE",null,null,null,"BLASTER",null,null,null,null,null,null,null,null,null,null,null,null,null,null,null,null,null,null,null,null,null,"NO",null,null,null,null,null,"Activa"]
["Proceso productivo","INYECCION","POLIPROPILENO DE BAJA",null,null,null,"I.O. PLASTIC SPRES",null,null,null,null,null,null,null,null,null,null,null,null,null,null,null,null,null,null,null,null,null,"NO",null,null,null,null,null,"Activa"]
["Proceso productivo","ORGANIK SILLAS","ACUAPIEL MV",null,null,null,"INCAP",null,null,null,null,null,null,null,null,null,null,null,null,null,null,null,null,null,null,null,null,null,"NO",null,null,null,null,null,"Activa"]
["Proceso productivo","ALMACÉN                                MADERAS","PEGANTE CUÑETE PARA ALFOMBRAS",null,null,null,"INCAP",null,null,null,null,null,null,null,null,null,null,null,null,null,null,null,null,null,null,null,null,null,"NO",null,null,null,null,null,"Activa"]
["Limpieza de maquinaria o utencilios","ALMACÉN                           DESPACHOS                                    TALON                          MADERAS                              LAVADO Y PINTURAS                            ORGANIK SILLAS                                 MANTENIIENTO                  COOPERATIVAS","THINER","AROMATICOS 42%                                     ALCOHOLES 44%                        ETERES 5%                       ESTERES 9% ","64742-89-3","Galon y Caneca de 5 galones","J.O.R. PINTURAS","2B","Líquido",null,98,0.3,"ND",1263,"3. Líquido Inflamable","No aplica",null,"Alcohol","GHS03_Llama_sobre_circulo","No_Aplica","No_Aplica","No_Aplica",null,null,null,"100 ppm",null,"FOR-CD-PR-13","SI",2016,"Español","Central de Disolventes S.A.S.","NO",null,"Activa"]
["Limpieza de maquinaria o utencilios","ALMACÉN                           DESPACHOS                                    TALON                          MADERAS                             ORGANIK SILLAS                                          MANTENIMIENTO                                  COOPERATIVAS ","VARSOL","MEZCLA COMPLEJA DE HIDROCARBUROS ENTRE C9 Y C12, PARAFINAS, CICLOPARAFINAS Y AROMATICOS","8052-41-3",null,"J.O.R. PINTURAS","NC ","Líquido",null,149,4.8,"ND",1268,"3. Líquido Inflamable","No aplica",null,"Hidrocarburos","GHS03_Llama_sobre_circulo","No_Aplica","No_Aplica","No_Aplica",null,null,null,"1000 ppm",null,null,"SI",2012,"Español","Central de Disolventes S.A.S.","NO",null,"Activa"]
[null,null,"HIDROXIDO",null,null,null,"KHEMRA",null,null,null,null,null,null,null,null,null,null,null,null,null,null,null,null,null,null,null,null,null,"NO",null,null,null,null,null,"Activa"]
[null,"ALMACÉN                            LAVADO Y PINTURA","KHEMRINSE N.C.R","ACIDO FOSFORICO 1-2%","7664-38-2",null,"KHEMRA","NC ","Líquido","4,1 - 4,9",98,"ND","ND",1805,"8. Sustancia corrosiva","No aplica",null,"Acido Fosforico",null,null,null,null,null,null,null,"1 mg/m3",null,null,"SI",2019,"Español","Khemra","NO",null,"Activa"]
[null,"ALMACÉN                         LAVADO Y PINTURA","KHEMTEX D.F","ACIDO FOSFORICO 1-4%                      2-BUTOXIETANOL 3-10%                               TENSOACTIVO 3-10%","7664-38-2                                                                         111-76-2",null,"KHEMRA",null,"Líquido","2,8 - 3,8",98,"ND","ND",1805,"8. Sustancia corrosiva","No aplica",null,"Acido Fosforico","GHS07_Signo_de_exclamación","GHS05_Corrosión","No_Aplica","No_Aplica",null,null,null,"1 mg/m3",null,null,"SI",2019,"Español","Khemra","SI","Ninguna","Activa"]
[null,"ALMACÉN                               LAVADO Y PINTURA","PINTURA ELECTROESTATICA",null,null,null,"KHEMRA",null,null,null,null,null,null,null,null,null,null,null,null,null,null,null,null,null,null,null,null,null,"NO",null,null,null,null,null,"Activa"]
[null,"INYECCION                                  TALON                        MANTENIMIENTO","SILICONA","METIL TRI SILANO                                       VINIL OXIMINO                               TETRAQUIS                                BUTANOMA","22984-54-9                                            2224-33-1                           34206-40-1                             96-29-7",null,"KHEMRA",3,null,8,"ND","ND","ND","NA","No aplica","No aplica",null,"METIL TRI SILANO                                       VINIL OXIMINO                               TETRAQUIS                                BUTANOMA","GHS07_Signo_de_exclamación","No_Aplica","No_Aplica","No_Aplica",null,"H319 Provoca irritación ocular grave.                                                         H317 Puede provocar una reacción alérgica en la piel.",null,null,null,null,"SI",2016,"Español","Quilosa Profesional","SI","Ninguna","Activa"]
[null,"ALMACÉN                           DESPACHOS                                    MADERAS                            ORGANIK SILLAS                        COOPERATIVAS","SILICONA (EMULSION)",null,"108-88-3                       64742-89-3                            141-78-6",null,"KHEMRA",null,null,"6,0 - 8,0",100,17,"ND","NA","No aplica","No aplica",null,null,null,null,null,null,null,null,null,null,null,null,"SI",null,null,"Productos de aseo New Day","NO",null,"Activa"]
[null,"ALMACÉN ","PEGANTE HOT MELT 21620Y",null,"7440-37-1",null,"PEGACAUCHOS S.A.",null,null,null,null,null,null,null,null,null,null,null,null,null,null,null,null,null,null,null,null,null,"NO",null,null,null,null,null,"Activa"]
[null,"ALMACÉN                           MADERAS                     ORGANIK SILLAS                          COOPERATIVAS","CEMENTO 321 HV  (BOXER AMARILLO)","TOLUENO 20-40%                            DISOLVENTE 20-40%                           ACETATO DE ETILO 5-10%                       CAUCHO SINTETICO 5-20%                      ADITIVOS 5-30%",null,null,"PEGATEX",null,"Líquido","-",42,113,"ND",1133,"3. Líquido Inflamable","No aplica",null,null,null,null,null,null,null,null,null,null,null,"HSEG_CEMENTO 321 HV_V3","SI",2018,"Español","Pagatex Artecola","NO",null,"Activa"]
[null,"ALMACÉN                                      MANTENIMIENTO","ACEITE LUBRICANTE 32",null,null,null,"POWER",null,null,null,null,null,null,null,null,null,null,null,null,null,null,null,null,null,null,null,null,null,"NO",null,null,null,null,null,"Activa"]
{"$rows_left_out":15}
{"sheet":"Etiqueta_SGA","index":2,"n_rows":53,"n_cols":20,"rows_kept":53,"cut":false,"hidden":false,"merged":[[12,1,12,2],[12,4,12,12],[1,16,1,19],[2,15,3,15],[2,16,3,19],[4,2,4,5],[7,2,11,6],[7,8,10,13],[7,14,8,16],[6,2,6,6],[6,8,6,12],[2,1,2,4],[2,5,2,13],[1,1,1,13]]}
[]
[null,{"$f":"Nombre","v":"GAS PROPANO  (GLP)"},null,null,null,null,null,null,null,null,null,null,null,null,null,"HOJA","Base_de_información"]
[null,"Contiene:",null,null,null,{"$f":"VLOOKUP(Nombre,Base_de_datos!C4:Y127,16,FALSE)","v":"Propano"},null,null,null,null,null,null,null,null,null,"Nombre comercial","GAS PROPANO  (GLP)"]
[]
[null,null,{"$f":"VLOOKUP(Nombre,Base_de_datos!C4:Y127,21,FALSE)","v":0},null,null,null,{"$f":"VLOOKUP(Nombre,Base_de_datos!C4:Y127,17,FALSE)","v":"GHS02_Llama"},null,{"$f":"VLOOKUP(Nombre,Base_de_datos!C4:Y127,18,FALSE)","v":"GHS04_Botella_de_gas"},null,{"$f":"VLOOKUP(Nombre,Base_de_datos!C4:Y127,19,FALSE)","v":"No_Aplica"},null,{"$f":"VLOOKUP(Nombre,Base_de_datos!C4:Y127,20,FALSE)","v":"No_Aplica"}]
[]
[null,null,"Indicación(es) de peligro: ",null,null,null,null,null,"Consejo(s) de prudencia:"]
[null,null,{"$f":"VLOOKUP(Nombre,Base_de_datos!C4:Y127,22,FALSE)","v":"PELIGROS FISICOS:\nH220 Gas extremadamente inflamable.\nH280 Contiene gas a presión; peligro de explosión en caso de calentamiento.\nPELIGROS PARA LA SALUD:\nNo está clasificado como un peligro para la salud según los criterios del Sistema Armonizado Mundial (CLP).\nPELIGROS MEDIOAMBIENTALES:\nNo se clasifican como amenaza ambiental según los criterios de CEE."},null,null,null,null,null,{"$f":"VLOOKUP(Nombre,Base_de_datos!C4:Y127,23,FALSE)","v":"Prevención:\nP102 Mantener fuera del alcance de los niños.\nP210 Mantener alejado del calor, de superficies calientes, de chispas, de llamas abiertas y de cualquier otra fuente de ignición. No fumar.\nP243 Tomar medidas de precaución contra descargas electrostáticas.\nIntervención:\nP377 Fuga de gas en llamas: No apagar, salvo si la fuga puede detenerse sin peligro.\nP381 Eliminar todas las fuentes de ignición si no hay peligro en hacerlo.\nAlmacenamiento:\nP410 + P403 Proteger de la luz del sol. Almacenar en un lugar bien ventilado.\nEliminación:\nSin frases de prudencia."}]
[]
[]
[]
[]
[null,"Fabricante:",null,null,{"$f":"VLOOKUP(Nombre,Base_de_datos!C4:Y127,5,FALSE)","v":"UNIGAS"}]
[]
[]
[]
[]
[]
[]
[]
{"$rows_left_out":34}
{"sheet":"Matriz_incomp","index":3,"n_rows":84,"n_cols":30,"rows_kept":84,"cut":false,"hidden":false,"merged":[[31,15,32,16],[31,17,32,27],[32,1,32,2],[33,15,35,16],[33,17,35,27],[34,1,34,2],[35,1,35,2],[28,15,28,21],[29,1,29,2],[29,15,30,16],[29,17,30,27],[30,1,30,2],[22,0,37,0],[22,1,22,2],[22,3,37,3],[23,1,23,2],[24,1,24,2],[25,1,25,2],[26,1,26,2],[27,1,27,2],[28,1,28,2],[33,1,33,2],[37,1,37,2],[31,1,31,2],[36,1,36,2],[21,1,21,2],[9,0,21,0],[9,1,9,2],[9,3,16,3],[10,1,10,2],[11,1,11,2],[12,1,12,2],[13,1,13,2],[14,1,14,2],[15,1,15,2],[16,1,16,2],[17,1,17,2],[17,3,20,3],[18,1,18,2],[19,1,19,2],[20,1,20,2],[5,0,7,0],[5,1,5,2],[5,3,7,3],[6,1,6,2],[7,1,7,2],[8,1,8,2],[0,27,3,27],[0,28,3,28],[4,1,4,2],[4,4,4,14],[4,16,4,19],[4,20,4,26],[0,21,3,21],[0,22,3,22],[0,23,3,23],[0,24,3,24],[0,25,3,25],[0,26,3,26],[0,15,3,15],[0,16,3,16],[0,17,3,17],[0,18,3,18],[0,19,3,19],[0,20,3,20],[0,9,3,9],[0,10,3,10],[0,11,3,11],[0,12,3,12],[0,13,3,13],[0,14,3,14],[0,8,3,8],[0,0,3,3],[0,4,3,4],[0,5,3,5],[0,6,3,6],[0,7,3,7]]}
["MATRIZ DE INCOMPATIBILIDAD PARA EL ALMACENAMIENTO DE PRODUCTOS QUÍMICOS",null,null,null,"JABON LAVALOZA","LIMPIAVIDRIOS","PINTURA ELECTROESTATICA(INTERIOR)","PINTURA ELECTROESTATICA(EXTERIOR)","AJAX BICARBONATO","SILICONA EMULSION","CEMENTO DE CONTACTO","PINTURA EN POLVO (EXTERIORES)","PINTURA EN POLVO","VINILO ACRILICO","PREFLEX MADERA","LUBRICANTE","LIMPIADOR DESINFECTANTE","CLOROX","KHEMRINSE NCR","KHEMTEXT DF","GASOLINA","LACAS Y SELLADORES","ESMALTE","EMULSAN","ACPM","THINNER","VARSOL","GAS DE SOLDADURA","GAS PROPANO","No. "]
[null,null,null,null,null,null,null,null,null,null,null,null,null,null,null,null,null,null,null,null,null,null,null,null,null,null,null,null,null,"No. "]
[]
[]
["CLASE /SUBCLASE ONU","PRODUCTOS",null,"DIVISION   /ONU","N.A"]
["2.1.GAS INFLAMABLE ","GAS PROPANO"]
[null,"SILICONA EN AEROSOL"]
[null,"PINTURA EN AEROSOL"]
["2.1.GAS NO INFLAMABLE,NO TOXICO","GAS DE SOLDADURA"]
["3.LIQUIDOS INFLAMABLES                                                                                                                                        8.SUSTANCIAS CORROSIVAS                                                                                                                                                              9.SUSTACIAS Y OBJETIVOS PELIGROSOS VARIOS ","VARSOL"]
[null,"THINNER"]
[null,"ACPM"]
[null,"EMULSAN"]
[null,"ESMALTES"]
[null,"BASE NITRO"]
[null,"LACAS Y SELLADORES"]
[null,"GASOLINA"]
[null,"KHEMTEX DF"]
[null,"KHEMRINS NCR"]
[null,"CLOROX"]
{"$rows_left_out":65}
{"sheet":"Instructivo","index":4,"n_rows":43,"n_cols":4,"rows_kept":43,"cut":false,"hidden":false,"merged":[]}
["LEA CUIDADOSAMENTE LAS INSTRUCCIONES PARA DILIGENCIAR EL FORMATO BASE DE SUSTANCIAS QUÍMICAS\n(No modifique la información contenida en las casillas, si requiere adicionar información para su proceso, hágalo después de la columna de \"USO ACTUAL\")"]
[]
["INFORMACIÓN GENERAL"]
["Diligencia el formato base en su totalidad, no deje espacios en blanco. Si la información no aparece en la ficha de seguridad, coloque la palabra \"No Reporta\""]
["Proceso operativo: Especifique el proceso de la empresa en el cual se utiliza o almacena la sustancia química."]
["Zona de almacenamiento: Especifique el área o el puesto de trabajo donde se almacena la sustancia química.",null,null," "]
["Nombre comercial: Escriba el nombre comercial tal como aparece en la ficha de seguridad en la sección No. 1."]
["Composición: Escriba el (los) componente (s) químico (s) como aparece(n) en la ficha de seguridad, que se encuentran en la sección No. 2 o 3. Si la ficha no especifica ninguno, colocar \"No Reporta\""]
["No. CAS: Es el número de identificación química y en frente de cada componente del numeral anterior, se deberán colocar todos los números CAS que se relacionen en la ficha de seguridad. Ver sección 2 o 3. Si no reporta ninguno, colocar \"No reporta CAS\""]
["Presentación: Especifique la presentación en la cual tiene la sustancia química (galón, caneca, IBC)."]
["Proveedor/Fabricante: Escriba el nombre del proveedor/fabricante que suministra la sustancia química"]
["CLASIFICACIÓN IARC"]
["Categoría IARC: Haga clic sobre el link y lo llevará al hipervínculo.\n       1. Digite en el recuadro cada No. CAS que reporta la ficha de seguridad y 2. coloque en la casilla la información que allí aparece:"]
["     3. Si el número CAS no aparece, digite: No listado"]
["PROPIEDADES FÍSICO QUÍMICAS"]
["Estado: Despliegue la lista y escoja una opción. Verifique la información en la sección No. 9 de la ficha de seguridad (propiedades fisicoquímicas) "]
["pH: En la sección 9, identifique el pH de la sustancia química"]
["Materiales incompatibles: En la sección 10, busque el ítem donde dice materiales incompatibles y coloque en esta casilla lo que allí aparece."]
["CLASIFICACIÓN PARA EL TRANSPORTE"]
["Número UN: Escriba el número de la Naciones Unidas que reporta la ficha de seguridad en la Sección No. 14 (dígito de 4 cifras)"]
{"$rows_left_out":24}
{"sheet":"Control de cambios del formato","index":5,"n_rows":7,"n_cols":6,"rows_kept":7,"cut":false,"hidden":false,"merged":[]}
["Versión","Fecha\n(dd/mm/aaaa)","Modificación \n(Breve descripción del cambio)","Ubicación del Cambio ","Por qué \n(Breve descripción de la razón de la modificación)","Quién realiza el cambio\n(Cargo y nombre)"]
["V.0","2017-01-01","Versión inicial","General","Creación del formato base","Alejandra Ramírez"]
["V.1","2021-02-02","*Se cambia el nombre del archivo a Base de datos de productos químicos\n*Se eliminan filas de información.\n*Se formula la etiqueta SGA","General","Actualización de la información y selección de información  por aquella relevante para un uso posterior\nSe formula la etiqueta SGA, para facilitar su implementación","Alejandra Ramírez"]
["V.2","2021-03-02","*Se ajustan mensajes salientes en la fila de títulos","General","Mejora de las indicaciones para el diligenciamiento","Alejandra Ramírez"]
["V.3","2021-03-07","* Se inserta la hoja menú \n* Se inserta la hoja de instrucciones.\n* Se adjunta matriz general de incompatibilidad.\n* Se adicionan íconos e hipervínculos a las hojas\n* Se adicionan listas de validación.","General","Mejora de las indicaciones para el diligenciamiento","Margorie Conde "]
["V.4","2021-03-11","* Se cambia el nombre de la segunda hoja por \"Base de datos\"\n* Se incluye la temperatura de ebullición y la presión de vapor en las propiedades fisicoquímicas de la base de datos\n* Se separan los códigos de las frases H y se elimina el diligenciamiento de la codificación de las frases P.","2da y 3ra hoja del libro","Se cambia el nombre por Base de datos de productos químicos, con el fin de clarificar su función. Se ajusta también en la etiqueta.\n\nSe incluyen propiedades fisicoquímicas para facilitar la valoración de la amenaza asociada a los peligros físicos.\n\nSe ajusta la información para la etiqueta SGA.","Alejandra Ramírez"]
["V.4","2021-05-12","* Se incluye comlumna para los nombre de los componentes que aportan peligros a la salud para que aparezcan en la etiqueta","Base_de_datos\nEtiqueta_SGA","Ajuste de acuerdo a lo indicado en la resolución 773 de 2021","Alejandra Ramírez"]